{"text_format":"3","workbook":"xlsx","n_sheets":2,"sheets":["Mortgage Calculator","Table"],"not_rendered":{"charts":1,"images":1,"macros":1,"defined_names":1},"read":"whole","date_system":"1900"}

{"sheet":"Mortgage Calculator","index":0,"n_rows":657,"n_cols":16,"rows_kept":657,"merged":[[11,1,12,5],[14,4,16,8]]}
[]
[]
[]
[]
[]
[]
[null,"Axis","X","Y"]
[null,"Max",{"$f":"D16","v":360},{"$f":"C17+20000","v":{"v":170000,"d":"$170,000.00"}}]
[null,"Min",0,0]
[null,"Tick",12,20000]
[]
[null,"Mortgage Payoff Calculator"]
[{"$nulls":6},"Provided by:","LifeAndMyFinances.com"]
[]
[null," Annual Interest Rate",{"v":0.04,"d":"4.00%"},null,{"$f":"\"By putting an extra $\"&C27&\" toward your \"&C16&\" year mortgage, you'll pay it off \"&C37&\" years early and save $\"&C38&\" in interest!!\"","v":"By putting an extra $500 toward your 30 year mortgage, you'll pay it off 16.7 years early and save $63578 in interest!!"}]
[null," Term of Loan (# of Years)",30,{"$f":"C16*12","v":360}]
[null," Beginning Loan Amount",{"v":150000,"d":"$150,000"}]
[null," Monthly Payment",{"$f":"PMT((C15/12),(C16*12),-C17)","v":{"v":716.1229431981893,"d":"$716.12"}}]
[]
[null," When Did Your Mortgage Start?"]
[null,"Month:","June",{"$f":"CONCATENATE(C21,\" \",C22)","v":"June 2017"}]
[null,"Year:",2017]
[null," When Will You Start Extra Payments?"]
[null,"Month:","August",{"$f":"CONCATENATE(C24,\" \",C25)","v":"August 2017"}]
[null,"Year:",2017]
[]
[null," Extra Amount Per Month",{"v":500,"d":"$500.00"}]
[]
[]
[]
[]
[null,{"$f":"\"Total Interest After\"&\" \"&C16&\" \"&\"Years\"","v":"Total Interest After 30 Years"},{"$f":"SUM(O58:O657)","v":{"v":107804.25955134824,"d":"$107,804.26"}}]
[null,"Your Interest Paid With Extra Payments",{"$f":"SUM(G58:G657)","v":{"v":44225.9772387979,"d":"$44,225.98"}}]
[]
[]
[null,"Mortgage Paid Off By",{"$f":"VLOOKUP(0, H57:I657,2,FALSE)","v":"October 2030"}]
[null,"Years Saved",{"$f":"ROUND(C16-C42,1)","v":16.7}]
[null,"Interest Saved",{"$f":"ROUND(C32-C33,0)","v":{"v":63578,"d":"$63,578"}}]
[]
[{"$nulls":3},{"$f":"VLOOKUP(0,H58:J657,3,FALSE)","v":550}]
[]
[null,"Years to Pay Off",{"$f":"(D40-J58)/12","v":{"v":13.333333333333334,"d":"13.3"}}]
{"$rows_empty":14}
[null,"Month","Payment","Additional Pmnt","Total Payment","Principle ","Interest","New Payoff",{"$nulls":3},"Month","Payment","Principle ","Interest","Old Payoff"]
[{"$f":"VLOOKUP(B58,Table!E:F,2,FALSE)","v":390},{"$f":"D21","v":"June 2017"},{"$f":"-$C$18+D58","v":{"v":-716.1229431981893,"d":"(716.12)"}},{"$f":"IF(B58=$D$24,-$C$27,0)","v":{"v":0,"d":"0.00"}},{"$f":"-(C58)","v":{"v":716.1229431981893,"d":"$716.12"}},{"$f":"-(G58+C58)","v":{"v":216.12294319818932,"d":"$216.12"}},{"$f":"C17*C15/12","v":{"v":500,"d":"$500.00"}},{"$f":"C17-F58","v":{"v":149783.8770568018,"d":"$149,783.88"}},{"$f":"B58","v":"June 2017"},{"$f":"A58","v":390},null,1,{"$f":"-C18","v":{"v":-716.1229431981893,"d":"($716.12)"}},{"$f":"-(O58+M58)","v":{"v":216.12294319818932,"d":"$216.12"}},{"$f":"C17*C15/12","v":{"v":500,"d":"$500.00"}},{"$f":"C17-N58","v":{"v":149783.8770568018,"d":"$149,783.88"}}]
[{"$f":"A58+1","v":391},{"$f":"VLOOKUP(A59,Table!D:F,2,FALSE)","v":"July 2017"},{"v":-716.1229431981893,"d":"(716.12)"},{"$f":"IF(D58<0, D58,IF(B59=$D$24,-$C$27,0))","v":{"v":0,"d":"0.00"}},{"$f":"IF(H58=0,0,-(C59))","v":{"v":716.1229431981893,"d":"$716.12"}},{"$f":"IF(H58=0,0,-(G59+C59))","v":{"v":216.84335300884993,"d":"$216.84"}},{"$f":"H58*$C$15/12","v":{"v":499.2795901893394,"d":"$499.28"}},{"$f":"IF(-C59>=H58,0,(H58-F59))","v":{"v":149567.03370379296,"d":"$149,567.03"}},{"$f":"B59","v":"July 2017"},{"$f":"A59","v":391},null,2,{"$f":"M58","v":{"v":-716.1229431981893,"d":"($716.12)"}},{"$f":"-(O59+M59)","v":{"v":216.84335300884993,"d":"$216.84"}},{"$f":"P58*$C$15/12","v":{"v":499.2795901893394,"d":"$499.28"}},{"$f":"IF(-M59>=P58,0,(P58-N59))","v":{"v":149567.03370379296,"d":"$149,567.03"}}]
[{"$f":"A59+1","v":392},{"$f":"VLOOKUP(A60,Table!D:F,2,FALSE)","v":"August 2017"},{"v":-1216.1229431981892,"d":"(1216.12)"},{"v":-500,"d":"(500.00)"},{"$f":"IF(H59=0,0,-(C60))","v":{"v":1216.1229431981892,"d":"$1,216.12"}},{"$f":"IF(H59=0,0,-(G60+C60))","v":{"v":717.5661641855461,"d":"$717.57"}},{"v":498.5567790126432,"d":"$498.56"},{"$f":"IF(-C60>=H59,0,(H59-F60))","v":{"v":148849.4675396074,"d":"$148,849.47"}},"August 2017",392,null,3,{"$f":"M59","v":{"v":-716.1229431981893,"d":"($716.12)"}},{"$f":"-(O60+M60)","v":{"v":217.56616418554614,"d":"$217.57"}},{"v":498.5567790126432,"d":"$498.56"},{"$f":"IF(-M60>=P59,0,(P59-N60))","v":{"v":149349.4675396074,"d":"$149,349.47"}}]
[393,{"$f":"VLOOKUP(A61,Table!D:F,2,FALSE)","v":"September 2017"},{"v":-1216.1229431981892,"d":"(1216.12)"},{"v":-500,"d":"(500.00)"},{"v":1216.1229431981892,"d":"$1,216.12"},{"v":719.9580513994979,"d":"$719.96"},{"v":496.1648917986913,"d":"$496.16"},{"v":148129.5094882079,"d":"$148,129.51"},"September 2017",393,null,4,{"v":-716.1229431981893,"d":"($716.12)"},{"v":218.29138473283132,"d":"$218.29"},{"v":497.831558465358,"d":"$497.83"},{"v":149131.17615487456,"d":"$149,131.18"}]
[394,{"$f":"VLOOKUP(A62,Table!D:F,2,FALSE)","v":"October 2017"},{"v":-1216.1229431981892,"d":"(1216.12)"},{"v":-500,"d":"(500.00)"},{"v":1216.1229431981892,"d":"$1,216.12"},{"v":722.3579115708296,"d":"$722.36"},{"v":493.76503162735963,"d":"$493.77"},{"v":147407.15157663706,"d":"$147,407.15"},"October 2017",394,null,5,{"v":-716.1229431981893,"d":"($716.12)"},{"v":219.01902268194078,"d":"$219.02"},{"v":497.10392051624854,"d":"$497.10"},{"v":148912.1571321926,"d":"$148,912.16"}]
[395,{"$f":"VLOOKUP(A63,Table!D:F,2,FALSE)","v":"November 2017"},{"v":-1216.1229431981892,"d":"(1216.12)"},{"v":-500,"d":"(500.00)"},{"v":1216.1229431981892,"d":"$1,216.12"},{"v":724.7657712760656,"d":"$724.77"},{"v":491.35717192212354,"d":"$491.36"},{"v":146682.385805361,"d":"$146,682.39"},"November 2017",395,null,6,{"v":-716.1229431981893,"d":"($716.12)"},{"v":219.74908609088067,"d":"$219.75"},{"v":496.37385710730865,"d":"$496.37"},{"v":148692.40804610171,"d":"$148,692.41"}]
[396,{"$f":"VLOOKUP(A64,Table!D:F,2,FALSE)","v":"December 2017"},{"v":-1216.1229431981892,"d":"(1216.12)"},{"v":-500,"d":"(500.00)"},{"v":1216.1229431981892,"d":"$1,216.12"},{"v":727.1816571803192,"d":"$727.18"},{"v":488.94128601787,"d":"$488.94"},{"v":145955.2041481807,"d":"$145,955.20"},"December 2017",396,null,7,{"v":-716.1229431981893,"d":"($716.12)"},{"v":220.48158304451692,"d":"$220.48"},{"v":495.6413601536724,"d":"$495.64"},{"v":148471.9264630572,"d":"$148,471.93"}]
[397,{"$f":"VLOOKUP(A65,Table!D:F,2,FALSE)","v":"January 2018"},{"v":-1216.1229431981892,"d":"(1216.12)"},{"v":-500,"d":"(500.00)"},{"v":1216.1229431981892,"d":"$1,216.12"},{"v":729.6055960375868,"d":"$729.61"},{"v":486.51734716060236,"d":"$486.52"},{"v":145225.5985521431,"d":"$145,225.60"},"January 2018",397,null,8,{"v":-716.1229431981893,"d":"($716.12)"},{"v":221.2165216546653,"d":"$221.22"},{"v":494.906421543524,"d":"$494.91"},{"v":148250.70994140254,"d":"$148,250.71"}]
[398,{"$f":"VLOOKUP(A66,Table!D:F,2,FALSE)","v":"February 2018"},{"v":-1216.1229431981892,"d":"(1216.12)"},{"v":-500,"d":"(500.00)"},{"v":1216.1229431981892,"d":"$1,216.12"},{"v":732.0376146910455,"d":"$732.04"},{"v":484.0853285071437,"d":"$484.09"},{"v":144493.56093745207,"d":"$144,493.56"},"February 2018",398,null,9,{"v":-716.1229431981893,"d":"($716.12)"},{"v":221.95391006018082,"d":"$221.95"},{"v":494.1690331380085,"d":"$494.17"},{"v":148028.75603134237,"d":"$148,028.76"}]
[399,{"$f":"VLOOKUP(A67,Table!D:F,2,FALSE)","v":"March 2018"},{"v":-1216.1229431981892,"d":"(1216.12)"},{"v":-500,"d":"(500.00)"},{"v":1216.1229431981892,"d":"$1,216.12"},{"v":734.477740073349,"d":"$734.48"},{"v":481.64520312484024,"d":"$481.65"},{"v":143759.08319737873,"d":"$143,759.08"},"March 2018",399,null,10,{"v":-716.1229431981893,"d":"($716.12)"},{"v":222.69375642704807,"d":"$222.69"},{"v":493.42918677114125,"d":"$493.43"},{"v":147806.06227491534,"d":"$147,806.06"}]
[400,{"$f":"VLOOKUP(A68,Table!D:F,2,FALSE)","v":"April 2018"},{"v":-1216.1229431981892,"d":"(1216.12)"},{"v":-500,"d":"(500.00)"},{"v":1216.1229431981892,"d":"$1,216.12"},{"v":736.9259992069267,"d":"$736.93"},{"v":479.19694399126246,"d":"$479.20"},{"v":143022.1571981718,"d":"$143,022.16"},"April 2018",400,null,11,{"v":-716.1229431981893,"d":"($716.12)"},{"v":223.43606894847147,"d":"$223.44"},{"v":492.68687424971785,"d":"$492.69"},{"v":147582.62620596687,"d":"$147,582.63"}]
[401,{"$f":"VLOOKUP(A69,Table!D:F,2,FALSE)","v":"May 2018"},{"v":-1216.1229431981892,"d":"(1216.12)"},{"v":-500,"d":"(500.00)"},{"v":1216.1229431981892,"d":"$1,216.12"},{"v":739.3824192042832,"d":"$739.38"},{"v":476.740523993906,"d":"$476.74"},{"v":142282.77477896752,"d":"$142,282.77"},"May 2018",401,null,12,{"v":-716.1229431981893,"d":"($716.12)"},{"v":224.18085584496646,"d":"$224.18"},{"v":491.94208735322286,"d":"$491.94"},{"v":147358.4453501219,"d":"$147,358.45"}]
[402,{"$f":"VLOOKUP(A70,Table!D:F,2,FALSE)","v":"June 2018"},{"v":-1216.1229431981892,"d":"(1216.12)"},{"v":-500,"d":"(500.00)"},{"v":1216.1229431981892,"d":"$1,216.12"},{"v":741.8470272682976,"d":"$741.85"},{"v":474.2759159298917,"d":"$474.28"},{"v":141540.92775169923,"d":"$141,540.93"},"June 2018",402,null,13,{"v":-716.1229431981893,"d":"($716.12)"},{"v":224.9281253644496,"d":"$224.93"},{"v":491.1948178337397,"d":"$491.19"},{"v":147133.51722475747,"d":"$147,133.52"}]
[403,{"$f":"VLOOKUP(A71,Table!D:F,2,FALSE)","v":"July 2018"},{"v":-1216.1229431981892,"d":"(1216.12)"},{"v":-500,"d":"(500.00)"},{"v":1216.1229431981892,"d":"$1,216.12"},{"v":744.319850692525,"d":"$744.32"},{"v":471.8030925056641,"d":"$471.80"},{"v":140796.6079010067,"d":"$140,796.61"},"July 2018",403,null,14,{"v":-716.1229431981893,"d":"($716.12)"},{"v":225.6778857823311,"d":"$225.68"},{"v":490.44505741585823,"d":"$490.45"},{"v":146907.83933897514,"d":"$146,907.84"}]
[404,{"$f":"VLOOKUP(A72,Table!D:F,2,FALSE)","v":"August 2018"},{"v":-1216.1229431981892,"d":"(1216.12)"},{"v":-500,"d":"(500.00)"},{"v":1216.1229431981892,"d":"$1,216.12"},{"v":746.8009168615001,"d":"$746.80"},{"v":469.322026336689,"d":"$469.32"},{"v":140049.8069841452,"d":"$140,049.81"},"August 2018",404,null,15,{"v":-716.1229431981893,"d":"($716.12)"},{"v":226.4301454016055,"d":"$226.43"},{"v":489.6927977965838,"d":"$489.69"},{"v":146681.40919357355,"d":"$146,681.41"}]
[405,{"$f":"VLOOKUP(A73,Table!D:F,2,FALSE)","v":"September 2018"},{"v":-1216.1229431981892,"d":"(1216.12)"},{"v":-500,"d":"(500.00)"},{"v":1216.1229431981892,"d":"$1,216.12"},{"v":749.2902532510386,"d":"$749.29"},{"v":466.83268994715064,"d":"$466.83"},{"v":139300.51673089416,"d":"$139,300.52"},"September 2018",405,null,16,{"v":-716.1229431981893,"d":"($716.12)"},{"v":227.18491255294418,"d":"$227.18"},{"v":488.93803064524514,"d":"$488.94"},{"v":146454.2242810206,"d":"$146,454.22"}]
[406,{"$f":"VLOOKUP(A74,Table!D:F,2,FALSE)","v":"October 2018"},{"v":-1216.1229431981892,"d":"(1216.12)"},{"v":-500,"d":"(500.00)"},{"v":1216.1229431981892,"d":"$1,216.12"},{"v":751.787887428542,"d":"$751.79"},{"v":464.3350557696472,"d":"$464.34"},{"v":138548.72884346562,"d":"$138,548.73"},"October 2018",406,null,17,{"v":-716.1229431981893,"d":"($716.12)"},{"v":227.94219559478728,"d":"$227.94"},{"v":488.18074760340204,"d":"$488.18"},{"v":146226.28208542583,"d":"$146,226.28"}]
[407,{"$f":"VLOOKUP(A75,Table!D:F,2,FALSE)","v":"November 2018"},{"v":-1216.1229431981892,"d":"(1216.12)"},{"v":-500,"d":"(500.00)"},{"v":1216.1229431981892,"d":"$1,216.12"},{"v":754.2938470533038,"d":"$754.29"},{"v":461.8290961448854,"d":"$461.83"},{"v":137794.4349964123,"d":"$137,794.43"},"November 2018",407,null,18,{"v":-716.1229431981893,"d":"($716.12)"},{"v":228.70200291343656,"d":"$228.70"},{"v":487.42094028475276,"d":"$487.42"},{"v":145997.5800825124,"d":"$145,997.58"}]
[408,{"$f":"VLOOKUP(A76,Table!D:F,2,FALSE)","v":"December 2018"},{"v":-1216.1229431981892,"d":"(1216.12)"},{"v":-500,"d":"(500.00)"},{"v":1216.1229431981892,"d":"$1,216.12"},{"v":756.8081598768149,"d":"$756.81"},{"v":459.31478332137436,"d":"$459.31"},{"v":137037.6268365355,"d":"$137,037.63"},"December 2018",408,null,19,{"v":-716.1229431981893,"d":"($716.12)"},{"v":229.46434292314797,"d":"$229.46"},{"v":486.65860027504135,"d":"$486.66"},{"v":145768.11573958927,"d":"$145,768.12"}]
[409,{"$f":"VLOOKUP(A77,Table!D:F,2,FALSE)","v":"January 2019"},{"v":-1216.1229431981892,"d":"(1216.12)"},{"v":-500,"d":"(500.00)"},{"v":1216.1229431981892,"d":"$1,216.12"},{"v":759.330853743071,"d":"$759.33"},{"v":456.7920894551183,"d":"$456.79"},{"v":136278.29598279242,"d":"$136,278.30"},"January 2019",409,null,20,{"v":-716.1229431981893,"d":"($716.12)"},{"v":230.22922406622507,"d":"$230.23"},{"v":485.89371913196425,"d":"$485.89"},{"v":145537.88651552305,"d":"$145,537.89"}]
[410,{"$f":"VLOOKUP(A78,Table!D:F,2,FALSE)","v":"February 2019"},{"v":-1216.1229431981892,"d":"(1216.12)"},{"v":-500,"d":"(500.00)"},{"v":1216.1229431981892,"d":"$1,216.12"},{"v":761.8619565888812,"d":"$761.86"},{"v":454.2609866093081,"d":"$454.26"},{"v":135516.43402620353,"d":"$135,516.43"},"February 2019",410,null,21,{"v":-716.1229431981893,"d":"($716.12)"},{"v":230.9966548131125,"d":"$231.00"},{"v":485.1262883850768,"d":"$485.13"},{"v":145306.88986070993,"d":"$145,306.89"}]
[411,{"$f":"VLOOKUP(A79,Table!D:F,2,FALSE)","v":"March 2019"},{"v":-1216.1229431981892,"d":"(1216.12)"},{"v":-500,"d":"(500.00)"},{"v":1216.1229431981892,"d":"$1,216.12"},{"v":764.4014964441774,"d":"$764.40"},{"v":451.72144675401177,"d":"$451.72"},{"v":134752.03252975934,"d":"$134,752.03"},"March 2019",411,null,22,{"v":-716.1229431981893,"d":"($716.12)"},{"v":231.76664366248957,"d":"$231.77"},{"v":484.35629953569975,"d":"$484.36"},{"v":145075.12321704742,"d":"$145,075.12"}]
[412,{"$f":"VLOOKUP(A80,Table!D:F,2,FALSE)","v":"April 2019"},{"v":-1216.1229431981892,"d":"(1216.12)"},{"v":-500,"d":"(500.00)"},{"v":1216.1229431981892,"d":"$1,216.12"},{"v":766.9495014323247,"d":"$766.95"},{"v":449.1734417658645,"d":"$449.17"},{"v":133985.083028327,"d":"$133,985.08"},"April 2019",412,null,23,{"v":-716.1229431981893,"d":"($716.12)"},{"v":232.53919914136458,"d":"$232.54"},{"v":483.58374405682474,"d":"$483.58"},{"v":144842.58401790605,"d":"$144,842.58"}]
[413,{"$f":"VLOOKUP(A81,Table!D:F,2,FALSE)","v":"May 2019"},{"v":-1216.1229431981892,"d":"(1216.12)"},{"v":-500,"d":"(500.00)"},{"v":1216.1229431981892,"d":"$1,216.12"},{"v":769.5059997704325,"d":"$769.51"},{"v":446.6169434277567,"d":"$446.62"},{"v":133215.57702855658,"d":"$133,215.58"},"May 2019",413,null,24,{"v":-716.1229431981893,"d":"($716.12)"},{"v":233.31432980516917,"d":"$233.31"},{"v":482.80861339302015,"d":"$482.81"},{"v":144609.26968810087,"d":"$144,609.27"}]
[414,{"$f":"VLOOKUP(A82,Table!D:F,2,FALSE)","v":"June 2019"},{"v":-1216.1229431981892,"d":"(1216.12)"},{"v":-500,"d":"(500.00)"},{"v":1216.1229431981892,"d":"$1,216.12"},{"v":772.0710197696671,"d":"$772.07"},{"v":444.051923428522,"d":"$444.05"},{"v":132443.5060087869,"d":"$132,443.51"},"June 2019",414,null,25,{"v":-716.1229431981893,"d":"($716.12)"},{"v":234.09204423785303,"d":"$234.09"},{"v":482.0308989603363,"d":"$482.03"},{"v":144375.17764386302,"d":"$144,375.18"}]
[415,{"$f":"VLOOKUP(A83,Table!D:F,2,FALSE)","v":"July 2019"},{"v":-1216.1229431981892,"d":"(1216.12)"},{"v":-500,"d":"(500.00)"},{"v":1216.1229431981892,"d":"$1,216.12"},{"v":774.6445898355662,"d":"$774.64"},{"v":441.478353362623,"d":"$441.48"},{"v":131668.86141895133,"d":"$131,668.86"},"July 2019",415,null,26,{"v":-716.1229431981893,"d":"($716.12)"},{"v":234.87235105197925,"d":"$234.87"},{"v":481.25059214621007,"d":"$481.25"},{"v":144140.30529281104,"d":"$144,140.31"}]
[416,{"$f":"VLOOKUP(A84,Table!D:F,2,FALSE)","v":"August 2019"},{"v":-1216.1229431981892,"d":"(1216.12)"},{"v":-500,"d":"(500.00)"},{"v":1216.1229431981892,"d":"$1,216.12"},{"v":777.2267384683514,"d":"$777.23"},{"v":438.8962047298378,"d":"$438.90"},{"v":130891.63468048298,"d":"$130,891.63"},"August 2019",416,null,27,{"v":-716.1229431981893,"d":"($716.12)"},{"v":235.65525888881922,"d":"$235.66"},{"v":480.4676843093701,"d":"$480.47"},{"v":143904.65003392223,"d":"$143,904.65"}]
[417,{"$f":"VLOOKUP(A85,Table!D:F,2,FALSE)","v":"September 2019"},{"v":-1216.1229431981892,"d":"(1216.12)"},{"v":-500,"d":"(500.00)"},{"v":1216.1229431981892,"d":"$1,216.12"},{"v":779.8174942632459,"d":"$779.82"},{"v":436.3054489349433,"d":"$436.31"},{"v":130111.81718621973,"d":"$130,111.82"},"September 2019",417,null,28,{"v":-716.1229431981893,"d":"($716.12)"},{"v":236.44077641844854,"d":"$236.44"},{"v":479.6821667797408,"d":"$479.68"},{"v":143668.20925750377,"d":"$143,668.21"}]
[418,{"$f":"VLOOKUP(A86,Table!D:F,2,FALSE)","v":"October 2019"},{"v":-1216.1229431981892,"d":"(1216.12)"},{"v":-500,"d":"(500.00)"},{"v":1216.1229431981892,"d":"$1,216.12"},{"v":782.4168859107901,"d":"$782.42"},{"v":433.7060572873991,"d":"$433.71"},{"v":129329.40030030895,"d":"$129,329.40"},"October 2019",418,null,29,{"v":-716.1229431981893,"d":"($716.12)"},{"v":237.22891233984336,"d":"$237.23"},{"v":478.89403085834596,"d":"$478.89"},{"v":143430.98034516393,"d":"$143,430.98"}]
[419,{"$f":"VLOOKUP(A87,Table!D:F,2,FALSE)","v":"November 2019"},{"v":-1216.1229431981892,"d":"(1216.12)"},{"v":-500,"d":"(500.00)"},{"v":1216.1229431981892,"d":"$1,216.12"},{"v":785.0249421971594,"d":"$785.02"},{"v":431.09800100102984,"d":"$431.10"},{"v":128544.37535811179,"d":"$128,544.38"},"November 2019",419,null,30,{"v":-716.1229431981893,"d":"($716.12)"},{"v":238.01967538097625,"d":"$238.02"},{"v":478.10326781721307,"d":"$478.10"},{"v":143192.96066978294,"d":"$143,192.96"}]
[420,{"$f":"VLOOKUP(A88,Table!D:F,2,FALSE)","v":"December 2019"},{"v":-1216.1229431981892,"d":"(1216.12)"},{"v":-500,"d":"(500.00)"},{"v":1216.1229431981892,"d":"$1,216.12"},{"v":787.6416920044833,"d":"$787.64"},{"v":428.481251193706,"d":"$428.48"},{"v":127756.7336661073,"d":"$127,756.73"},"December 2019",420,null,31,{"v":-716.1229431981893,"d":"($716.12)"},{"v":238.8130742989128,"d":"$238.81"},{"v":477.3098688992765,"d":"$477.31"},{"v":142954.14759548404,"d":"$142,954.15"}]
[421,{"$f":"VLOOKUP(A89,Table!D:F,2,FALSE)","v":"January 2020"},{"v":-1216.1229431981892,"d":"(1216.12)"},{"v":-500,"d":"(500.00)"},{"v":1216.1229431981892,"d":"$1,216.12"},{"v":790.2671643111648,"d":"$790.27"},{"v":425.85577888702437,"d":"$425.86"},{"v":126966.46650179614,"d":"$126,966.47"},"January 2020",421,null,32,{"v":-716.1229431981893,"d":"($716.12)"},{"v":239.60911787990915,"d":"$239.61"},{"v":476.51382531828017,"d":"$476.51"},{"v":142714.53847760413,"d":"$142,714.54"}]
[422,{"$f":"VLOOKUP(A90,Table!D:F,2,FALSE)","v":"February 2020"},{"$f":"-$C$18+D90","v":{"v":-1216.1229431981892,"d":"(1216.12)"}},{"v":-500,"d":"(500.00)"},{"v":1216.1229431981892,"d":"$1,216.12"},{"v":792.9013881922021,"d":"$792.90"},{"v":423.2215550059871,"d":"$423.22"},{"v":126173.56511360394,"d":"$126,173.57"},"February 2020",422,null,33,{"v":-716.1229431981893,"d":"($716.12)"},{"v":240.4078149395089,"d":"$240.41"},{"v":475.7151282586804,"d":"$475.72"},{"v":142474.13066266463,"d":"$142,474.13"}]
[423,{"$f":"VLOOKUP(A91,Table!D:F,2,FALSE)","v":"March 2020"},{"v":-1216.1229431981892,"d":"(1216.12)"},{"v":-500,"d":"(500.00)"},{"v":1216.1229431981892,"d":"$1,216.12"},{"v":795.5443928195093,"d":"$795.54"},{"v":420.57855037867984,"d":"$420.58"},{"v":125378.02072078442,"d":"$125,378.02"},"March 2020",423,null,34,{"v":-716.1229431981893,"d":"($716.12)"},{"v":241.20917432264054,"d":"$241.21"},{"v":474.9137688755488,"d":"$474.91"},{"v":142232.921488342,"d":"$142,232.92"}]
[424,{"$f":"VLOOKUP(A92,Table!D:F,2,FALSE)","v":"April 2020"},{"v":-1216.1229431981892,"d":"(1216.12)"},{"v":-500,"d":"(500.00)"},{"v":1216.1229431981892,"d":"$1,216.12"},{"v":798.1962074622411,"d":"$798.20"},{"v":417.9267357359481,"d":"$417.93"},{"v":124579.82451332218,"d":"$124,579.82"},"April 2020",424,null,35,{"v":-716.1229431981893,"d":"($716.12)"},{"v":242.01320490371597,"d":"$242.01"},{"v":474.10973829447335,"d":"$474.11"},{"v":141990.90828343827,"d":"$141,990.91"}]
[425,{"$f":"VLOOKUP(A93,Table!D:F,2,FALSE)","v":"May 2020"},{"v":-1216.1229431981892,"d":"(1216.12)"},{"v":-500,"d":"(500.00)"},{"v":1216.1229431981892,"d":"$1,216.12"},{"v":800.8568614871153,"d":"$800.86"},{"v":415.2660817110739,"d":"$415.27"},{"v":123778.96765183506,"d":"$123,778.97"},"May 2020",425,null,36,{"v":-716.1229431981893,"d":"($716.12)"},{"v":242.81991558672837,"d":"$242.82"},{"v":473.30302761146095,"d":"$473.30"},{"v":141748.08836785154,"d":"$141,748.09"}]
{"$rows_left_out":565}
{"sheet":"Table","index":1,"n_rows":1155,"n_cols":11,"rows_kept":1155,"hidden":true}
[]
[]
[null,"Month","Year","Count","Month Date","Count",null,null,"Month","Past Year","Start Payoff Year"]
[1,"January",1985,1,{"$f":"CONCATENATE(B4,\" \",C4)","v":"January 1985"},1,null,null,"January",1985,2017]
[2,"February",1985,2,{"$f":"CONCATENATE(B5,\" \",C5)","v":"February 1985"},2,null,null,"February",1986,2018]
[3,"March",1985,3,"March 1985",3,null,null,"March",1987,2019]
[4,"April",1985,4,"April 1985",4,null,null,"April",1988,2020]
[5,"May",1985,5,"May 1985",5,null,null,"May",1989,2021]
[6,"June",1985,6,"June 1985",6,null,null,"June",1990,2022]
[7,"July",1985,7,"July 1985",7,null,null,"July",1991,2023]
[8,"August",1985,8,"August 1985",8,null,null,"August",1992,2024]
[9,"September",1985,9,"September 1985",9,null,null,"September",1993,2025]
[10,"October",1985,10,"October 1985",10,null,null,"October",1994,2026]
[11,"November",1985,11,"November 1985",11,null,null,"November",1995,2027]
[12,"December",1985,12,"December 1985",12,null,null,"December",1996,2028]
[13,"January",1986,13,"January 1986",13,{"$nulls":3},1997,2029]
[14,"February",1986,14,"February 1986",14,{"$nulls":3},1998,2030]
[15,"March",1986,15,"March 1986",15,{"$nulls":3},1999,2031]
[16,"April",1986,16,"April 1986",16,{"$nulls":3},2000,2032]
[17,"May",1986,17,"May 1986",17,{"$nulls":3},2001,2033]
[18,"June",1986,18,"June 1986",18,{"$nulls":3},2002,2034]
[19,"July",1986,19,"July 1986",19,{"$nulls":3},2003,2035]
[20,"August",1986,20,"August 1986",20,{"$nulls":3},2004,2036]
[21,"September",1986,21,"September 1986",21,{"$nulls":3},2005,2037]
[22,"October",1986,22,"October 1986",22,{"$nulls":3},2006,2038]
[23,"November",1986,23,"November 1986",23,{"$nulls":3},2007,2039]
[24,"December",1986,24,"December 1986",24,{"$nulls":3},2008,2040]
[25,"January",1987,25,"January 1987",25,{"$nulls":3},2009,2041]
[26,"February",1987,26,"February 1987",26,{"$nulls":3},2010,2042]
[27,"March",1987,27,"March 1987",27,{"$nulls":3},2011,2043]
[28,"April",1987,28,"April 1987",28,{"$nulls":3},2012,2044]
[29,"May",1987,29,"May 1987",29,{"$nulls":3},2013,2045]
[30,"June",1987,30,"June 1987",30,{"$nulls":3},2014,2046]
[31,"July",1987,31,"July 1987",31,{"$nulls":3},2015,2047]
[32,"August",1987,32,"August 1987",32,{"$nulls":3},2016,2048]
[33,"September",1987,33,"September 1987",33,{"$nulls":3},2017,2049]
[34,"October",1987,34,"October 1987",34,{"$nulls":3},2018,2050]
[35,"November",1987,35,"November 1987",35,{"$nulls":3},2019,2051]
[36,"December",1987,36,"December 1987",36,{"$nulls":3},2020,2052]
[37,"January",1988,37,"January 1988",37,{"$nulls":3},2021,2053]
[38,"February",1988,38,"February 1988",38,{"$nulls":4},2054]
[39,"March",1988,39,"March 1988",39,{"$nulls":4},2055]
[40,"April",1988,40,"April 1988",40,{"$nulls":4},2056]
[41,"May",1988,41,"May 1988",41,{"$nulls":4},2057]
[42,"June",1988,42,"June 1988",42,{"$nulls":4},2058]
[43,"July",1988,43,"July 1988",43,{"$nulls":4},2059]
[44,"August",1988,44,"August 1988",44,{"$nulls":4},2060]
[45,"September",1988,45,"September 1988",45,{"$nulls":4},2061]
[46,"October",1988,46,"October 1988",46,{"$nulls":4},2062]
[47,"November",1988,47,"November 1988",47,{"$nulls":4},2063]
[48,"December",1988,48,"December 1988",48,{"$nulls":4},2064]
[49,"January",1989,49,"January 1989",49,{"$nulls":4},2065]
[50,"February",1989,50,"February 1989",50,{"$nulls":4},2066]
[51,"March",1989,51,"March 1989",51,{"$nulls":4},2067]
[52,"April",1989,52,"April 1989",52,{"$nulls":4},2068]
[53,"May",1989,53,"May 1989",53,{"$nulls":4},2069]
[54,"June",1989,54,"June 1989",54,{"$nulls":4},2070]
[55,"July",1989,55,"July 1989",55,{"$nulls":4},2071]
[56,"August",1989,56,"August 1989",56,{"$nulls":4},2072]
[57,"September",1989,57,"September 1989",57,{"$nulls":4},2073]
[58,"October",1989,58,"October 1989",58,{"$nulls":4},2074]
[59,"November",1989,59,"November 1989",59,{"$nulls":4},2075]
[60,"December",1989,60,"December 1989",60,{"$nulls":4},2076]
[61,"January",1990,61,"January 1990",61,{"$nulls":4},2077]
[62,"February",1990,62,"February 1990",62,{"$nulls":4},2078]
[63,"March",1990,63,"March 1990",63,{"$nulls":4},2079]
[64,"April",1990,64,"April 1990",64,{"$nulls":4},2080]
[65,"May",1990,65,"May 1990",65,{"$nulls":4},2081]
[66,"June",1990,66,{"$f":"CONCATENATE(B69,\" \",C69)","v":"June 1990"},66,{"$nulls":4},2082]
[67,"July",1990,67,"July 1990",67,{"$nulls":4},2083]
[68,"August",1990,68,"August 1990",68,{"$nulls":4},2084]
[69,"September",1990,69,"September 1990",69,{"$nulls":4},2085]
[70,"October",1990,70,"October 1990",70]
[71,"November",1990,71,"November 1990",71]
[72,"December",1990,72,"December 1990",72]
[73,"January",1991,73,"January 1991",73]
[74,"February",1991,74,"February 1991",74]
[75,"March",1991,75,"March 1991",75]
[76,"April",1991,76,"April 1991",76]
[77,"May",1991,77,"May 1991",77]
{"$rows_left_out":1075}